{"text_format":"1","workbook":"xlsx","n_sheets":4,"sheets":["how to run","calculate","graph","do_not_touch_this_sheet"],"not_rendered":{"charts":2,"images":0,"macros":1,"external_links":0,"defined_names":0,"comments":0,"pivot_tables":0},"unopened":[],"bounds":{"document_bytes":16777216,"sheet_cells":100000,"rows_first":2000,"rows_last":500,"rows_between":2000,"halvings":0,"cell_chars":16384,"cell_head_chars":4096},"cells_cut":0,"cells_raw":0,"read":"whole","date_system":"1900"}

{"sheet":"how to run","index":0,"n_rows":0,"n_cols":0,"rows_kept":0,"cut":false,"hidden":false,"merged":[]}

{"sheet":"calculate","index":1,"n_rows":37,"n_cols":7,"rows_kept":37,"cut":false,"hidden":false,"merged":[]}
["sequence","MHHHHHHMDRSKENCISGPVKATAPVGGPKRVLVTQQFPCQNPLPVNSGQAQRVLCPSNSSQRIPLQAQKLVSSHKPVQNQKQKQLQATSVPHPVSRPLNNTQKSKQPLPSAPENNPEEELASKQKNEESKKRQWALEDFEIGRPLGKGKFGNVYLAREKQSKFILALKVLFKAQLEKAGVEHQLRREVEIQSHLRHPNILRLYGYFHDATRVYLILEYAPLGTVYRELQKLSKFDEQRTATYITELANALSYCHSKRVIHRDIKPENLLLGSAGELKIADFGWSVHAPSSRRTTLCGTLDYLPPEMIEGRMHDEKVDLWSLGVLCYEFLVGKPPFEANTYQETYKRISRVEFTFPDFVTEGARDLISRLLKHNPSQRPMLREVLEHPWITANSSKPSNCQNKESASKQS"]
["sequence length",{"$f":"LEN(B1)","v":410}]
["first AA number",1,"(if some sequence offset occurs)"]
["peptide from",1]
["peptide to",20,null,null,null,null,"=ČÁST(B1;(G3-G2)+1;(G4-G3)+1)"]
["peptide",{"$f":"MID(B1,(B4-B3)+1,(B5-B4)+1)","v":"MHHHHHHMDRSKENCISGPV"},null,null,null,null,"=MID(B1,(B4-B3)+1,(B5-B4)+1)"]
["temperature (°C)",4]
["pD",7.5]
["bulgarian constant",1,"(correction)"]
["timescale 0 to",119.99999999999746,"s","noD","noEx"]
["graph time step",0.1,"s ",{"$f":"(B9)*SUM(D19:D36)","v":16.656269677754445},17]
["mol type","poly"]
["omitted N-term bonds",1]
[null,"SEQ","PREDICTED kc (/s)"]
[-1]
[0,"NT",{"$f":"IF(OR(OR(OR(OR(OR(OR($B16=\"\",$B16=\"P\"),$B16=\"Pc\"),$B16=\"Ac\"),$B16=\"NT\"),$B16=\"Nt\"),$B15=\"\"),0,IF($C$10=\"min\",(do_not_touch_this_sheet!$K16+do_not_touch_this_sheet!$L16+do_not_touch_this_sheet!$M16)*60,IF($C$10=\"hr\",3600*(do_not_touch_this_sheet!$K16+do_not_touch_this_sheet!$L16+do_not_touch_this_sheet!$M16),IF($C$10=\"s\",(do_not_touch_this_sheet!$K16+do_not_touch_this_sheet!$L16+do_not_touch_this_sheet!$M16*0)))))","v":0},{"$f":"1-EXP(-C16*$B$10)","v":0}]
[{"$f":"A16+$B$3","v":1},{"$f":"MID($B$6,IF((A17-$B$3)=0,1,(A17-$B$3)+1),1)","v":"M"},{"$f":"IF(OR(OR(OR(OR(OR(OR($B17=\"\",$B17=\"P\"),$B17=\"Pc\"),$B17=\"Ac\"),$B17=\"NT\"),$B17=\"Nt\"),$B16=\"\"),0,IF($C$10=\"min\",(do_not_touch_this_sheet!$K17+do_not_touch_this_sheet!$L17+do_not_touch_this_sheet!$M17)*60,IF($C$10=\"hr\",3600*(do_not_touch_this_sheet!$K17+do_not_touch_this_sheet!$L17+do_not_touch_this_sheet!$M17),IF($C$10=\"s\",(do_not_touch_this_sheet!$K17+do_not_touch_this_sheet!$L17+do_not_touch_this_sheet!$M17*0)))))","v":0},{"$f":"1-EXP(-C17*$B$10)","v":0}]
[{"$f":"A17+1","v":2},{"$f":"MID($B$6,IF((A18-$B$3)=0,1,(A18-$B$3)+1),1)","v":"H"},{"$f":"IF(OR(OR(OR(OR(OR(OR($B18=\"\",$B18=\"P\"),$B18=\"Pc\"),$B18=\"Ac\"),$B18=\"NT\"),$B18=\"Nt\"),$B17=\"\"),0,IF($C$10=\"min\",(do_not_touch_this_sheet!$K18+do_not_touch_this_sheet!$L18+do_not_touch_this_sheet!$M18)*60,IF($C$10=\"hr\",3600*(do_not_touch_this_sheet!$K18+do_not_touch_this_sheet!$L18+do_not_touch_this_sheet!$M18),IF($C$10=\"s\",(do_not_touch_this_sheet!$K18+do_not_touch_this_sheet!$L18+do_not_touch_this_sheet!$M18*0)))))","v":175.84615183206932},1]
[{"$f":"A18+1","v":3},"H",{"$f":"IF(OR(OR(OR(OR(OR(OR($B19=\"\",$B19=\"P\"),$B19=\"Pc\"),$B19=\"Ac\"),$B19=\"NT\"),$B19=\"Nt\"),$B18=\"\"),0,IF($C$10=\"min\",(do_not_touch_this_sheet!$K19+do_not_touch_this_sheet!$L19+do_not_touch_this_sheet!$M19)*60,IF($C$10=\"hr\",3600*(do_not_touch_this_sheet!$K19+do_not_touch_this_sheet!$L19+do_not_touch_this_sheet!$M19),IF($C$10=\"s\",(do_not_touch_this_sheet!$K19+do_not_touch_this_sheet!$L19+do_not_touch_this_sheet!$M19*0)))))","v":12.701969363234028},1]
[4,"H",{"$f":"IF(OR(OR(OR(OR(OR(OR($B20=\"\",$B20=\"P\"),$B20=\"Pc\"),$B20=\"Ac\"),$B20=\"NT\"),$B20=\"Nt\"),$B19=\"\"),0,IF($C$10=\"min\",(do_not_touch_this_sheet!$K20+do_not_touch_this_sheet!$L20+do_not_touch_this_sheet!$M20)*60,IF($C$10=\"hr\",3600*(do_not_touch_this_sheet!$K20+do_not_touch_this_sheet!$L20+do_not_touch_this_sheet!$M20),IF($C$10=\"s\",(do_not_touch_this_sheet!$K20+do_not_touch_this_sheet!$L20+do_not_touch_this_sheet!$M20*0)))))","v":12.701969363234028},1]
{"$rows_left_out":18}
{"sheet":"graph","index":2,"n_rows":1206,"n_cols":4,"rows_kept":1206,"cut":false,"hidden":false,"merged":[]}
[]
[null,"timescale 0 to",120,"s"]
[null,"graph time step",{"$f":"calculate!B11","v":0.1},"s "]
[]
[null,"Time","noD"]
[null,0,0]
[null,0.1,5.8172108084962755]
[null,0.2,8.338643136444837]
[null,0.3,9.7155118214710079]
[null,0.4,10.623757153466759]
[null,0.5,11.296754342119058]
[null,0.6,11.828013452178498]
[null,0.7,12.262622599494758]
[null,0.8,12.62638793773808]
[null,0.9,12.935994491032961]
[null,1,13.20305702286346]
[null,1.1000000000000001,13.436019378065071]
[null,1.2,13.641191706372371]
[null,1.3,13.823384911024933]
[null,1.4,13.98632771195747]
{"$rows_left_out":1187}
{"sheet":"do_not_touch_this_sheet","index":3,"n_rows":37,"n_cols":30,"rows_kept":37,"cut":false,"hidden":false,"merged":[]}
[null,null,null,null,null,"FACTORS",null,"10/18/93"]
[null,"",null,"MILNE","ACID",null,"MILNE","BASE",null,"pK(D,20c) =",15.05,"ka (/s) =",{"$f":"IF(calculate!$B$12=\"poly\",$W3,IF($B$5=\"oligo\",$X3,\"WRONG\"))","v":0.69478230578389266},null,null,"1/(dT*R)=",{"$f":"(1/(calculate!$B7+273)-1/293)/$AA$5","v":9.9214403609787142E-5},null,null,"(cal/mol)",null,null,"POLY","OLIGO",null,null,null,null,"Ea,asp =",1000]
[null,null,null,"LAMBDA","RHO",null,"LAMBDA","RHO",null,"pKc(Asp)=",{"$f":"LOG(10^(-1*4.48)*EXP(-1*$AD$2*((1/(calculate!B7+273.15)-1/278)/$AA$5)))*-1","v":4.4824112691571072},"kb (/s) =",{"$f":"IF(calculate!$B$12=\"poly\",$W4,IF($B$5=\"oligo\",$X4,\"WRONG\"))","v":187003075.71699455},null,null,"Fta =",{"$f":"EXP(-1*$T$3*$Q$2)","v":0.24932409299649003},null,"Ea,A =",14000,null,"ka (/s) =",{"$f":"(10^(1.62))/60","v":0.69478230578389266},{"$f":"W3*2.34","v":1.6257905955343088},null,"[D+] =",{"$f":"10^(-1*calculate!B8)","v":3.1622776601683699E-8},null,"Ea,glu =",1083]
[null,null,null,null,null,null,null,null,null,"pKc(Glu)=",{"$f":"LOG(10^(-1*4.93)*EXP(-1*$AD$3*((1/(calculate!B7+273.15)-1/278)/$AA$5)))*-1","v":4.9326114044971474},"kw (/s) =",{"$f":"IF(calculate!$B$12=\"poly\",$W5,IF($B$5=\"oligo\",$X5,\"WRONG\"))","v":5.2704627669472972E-4},null,null,"Ftb =",{"$f":"EXP(-1*$T$4*$Q$2)","v":0.18513965230309096},null,"Ea,B =",17000,null,"kb (/s) =",{"$f":"(10^(10.05))/60","v":187003075.71699455},{"$f":"W4*1.35","v":252454152.21794266},null,"[OD-] =",{"$f":"10^(calculate!$B$8-$K$2)","v":2.8183829312644468E-8},null,"Ea,his =",7500]
["ALANINE",null,"A",0,0,null,0,0,null,"pKc(His)=",{"$f":"LOG(10^(-1*7.42)*EXP(-1*$AD$4*((1/(calculate!B7+273.15)-1/278)/$AA$5)))*-1","v":7.4380845186783011},null,null,null,null,"Ftw =",{"$f":"EXP(-1*$T$5*$Q$2)","v":0.15181787480929809},null,"Ea,W =",19000,null,"kw (/s) =",{"$f":"(10^(-1.5))/60","v":5.2704627669472972E-4},{"$f":"W5*1.585","v":8.353683485611466E-4},null," R =",1.9870000000000001]
["CYSTEIN",null,"C",-0.54,-0.46,null,0.62,0.55000000000000004]
["CYSTINE",null,"C2",-0.74,-0.57999999999999996,null,0.55000000000000004,0.46]
["ASPARTIC ACID",null,"D",{"$f":"LOG(10^(-0.9-calculate!$B$8)/(10^(-$K$3)+10^(-calculate!$B$8))+10^(0.9-$K$3)/(10^(-$K3)+10^(-calculate!$B$8)))","v":0.89958975282513043},{"$f":"LOG(10^(-0.12-calculate!$B$8)/(10^(-$K$3)+10^(-calculate!$B$8))+10^(0.58-$K$3)/(10^(-$K$3)+10^(-calculate!$B$8)))","v":0.5796663488370023},null,{"$f":"LOG(10^(0.69-calculate!$B$8)/(10^(-$K$3)+10^(-calculate!$B$8))+10^(-0.3-$K$3)/(10^(-$K$3)+10^(-calculate!$B$8)))","v":-0.29636022435228304},{"$f":"LOG(10^(0.6-calculate!$B$8)/(10^(-$K$3)+10^(-calculate!$B$8))+10^(-0.18-$K$3)/(10^(-$K$3)+10^(-calculate!$B$8)))","v":-0.17791108192827909},null,null,"peptide length",{"$f":"LEN(calculate!B6)","v":20}]
["ASP COOH",null,"D+",-0.9,-0.12,null,0.69,0.6,null,null,"supporting cell","A18:A36","K16:S37"]
["GLUTAMIC ACID",null,"E",{"$f":"LOG(10^(-0.6-calculate!$B$8)/(10^(-$K$4)+10^(-calculate!$B$8))+10^(-0.9-$K$4)/(10^(-$K$4)+10^(-calculate!$B$8)))","v":-0.89883432916451378},{"$f":"LOG(10^(-0.27-calculate!$B$8)/(10^(-$K$4)+10^(-calculate!$B$8))+10^(0.31-$K$4)/(10^(-$K$4)+10^(-calculate!$B$8)))","v":0.309134821837181},null,{"$f":"LOG(10^(0.24-calculate!$B$8)/(10^(-$K$4)+10^(-calculate!$B$8))+10^(-0.51-$K$4)/(10^(-$K$4)+10^(-calculate!$B$8)))","v":-0.50461126414292001},{"$f":"LOG(10^(0.39-calculate!$B$8)/(10^(-$K$4)+10^(-calculate!$B$8))+10^(-0.15-$K$4)/(10^(-$K$4)+10^(-calculate!$B$8)))","v":-0.14711588550031127},null,null,null,"B17:B36","D16:D37"]
["GLU COOH",null,"E+",-0.6,-0.27,null,0.24,0.39,null,null,null,"C16:C37"]
["PHENYLALANINE",null,"F",-0.52,-0.43,null,-0.23585946405917099,6.3131586630097797E-2,null,null,"Fa*ka*D","Fb*kb*OD","Fb*kw",null,"SLOWING","Kop","delta G","Fa","Fb"]
["GLYCINE",null,"G",-0.22,0.21817604712038599,null,0.26725156928602301,0.17,null,null,"*Fta(T)","*Ftb(T)","*Ftw(T)","SF","FACTOR",null,"(kcal)"]
["HIS ",null,"H",{"$f":"LOG(10^(-0.8-calculate!$B$8)/(10^(-$K$5)+10^(-calculate!$B$8))+10^(0-$K$5)/(10^(-$K$5)+10^(-calculate!$B$8)))","v":-0.21524966175392235},{"$f":"LOG(10^(-0.51-calculate!$B$8)/(10^(-$K$5)+10^(-calculate!$B$8))+10^(0-$K$5)/(10^(-$K$5)+10^(-calculate!$B$8)))","v":-0.16806607155121603},null,{"$f":"LOG(10^(0.8-calculate!$B$8)/(10^(-$K$5)+10^(-calculate!$B$8))+10^(-0.1-$K$5)/(10^(-$K$5)+10^(-calculate!$B$8)))","v":0.52578467538348928},{"$f":"LOG(10^(0.83-calculate!$B$8)/(10^(-$K$5)+10^(-calculate!$B$8))+10^(0.14-$K$5)/(10^(-$K$5)+10^(-calculate!$B$8)))","v":0.58873819204372724},null,null,null,null,null,null,"Log(kc/kex)"]
["ISOLEUCINE",null,"I",-0.91,-0.59,null,-0.73,-0.23]
["LYSINE",null,"K",-0.56000000000000005,-0.28999999999999998,null,-0.04,0.12,null,null,{"$f":"IFERROR(IF(calculate!$B15=\"   ---\",\"\",$M$2*$AA$3*$Q$3*$R16),0)","v":0},{"$f":"IFERROR(IF(calculate!$B15=\"   ---\",\"\",$M$3*$AA$4*$Q$4*$S16),0)","v":0},{"$f":"IFERROR(IF(calculate!$B15=\"   ---\",\"\",$M$4*$Q$5*$S16),0)","v":0},{"$f":"KDYŽ(NEBO(NEBO(calculate!$C$10=\"hr\",calculate!$C$10=\"s\"),calculate!$C$10=\"min\"),KDYŽ(calculate!$C11=\"\",\"   ---\",(calculate!$D11/calculate!$C11)),\"   ?\")","v":{"$error":"#NAME?"}},{"$f":"KDYŽ(NEBO(NEBO(calculate!$C$10=\"hr\",calculate!$C$10=\"s\"),calculate!$C$10=\"min\"),KDYŽ(calculate!C11=\"\",\"   ---\",LOGZ(calculate!$D11/calculate!$C11)),\"   ?\")","v":{"$error":"#NAME?"}},{"$f":"KDYŽ(NEBO(NEBO(calculate!$C$10=\"hr\",calculate!$C$10=\"s\"),calculate!$C$10=\"min\"),KDYŽ(calculate!$C11=\"\",\"\",calculate!$C11/(calculate!$D11-calculate!$C11)),\"   ?\")","v":{"$error":"#NAME?"}},{"$f":"KDYŽ(calculate!$G11=\"\",\"\",KDYŽ(calculate!$G11=\"   ?\",\"   ?\",-1*$AA$5*calculate!$B$3*LN(calculate!$G11)/1000))","v":{"$error":"#NAME?"}},{"$f":"IF(OR(calculate!$B16=\"P\",calculate!$B16=\"\",calculate!$B16=\"AC\",calculate!$B16=\"NT\",calculate!$B16=\"Pc\",calculate!$B16=\"CT\",calculate!$B15=\"NT\"),\"   ---\",(IF(AND(OR(calculate!$B14=\"NT\",calculate!$B14=\"\"),calculate!$B17=\"CT\",NOT(calculate!$B15=\"Ac\"),NOT(calculate!$B16=\"NMe\")),10^(VLOOKUP(calculate!$B16,$C$5:$H$32,2,FALSE)+VLOOKUP(calculate!$B15,$C$5:$H$32,3,FALSE)+$E$29+$D$30),(IF(AND(OR(calculate!$B14=\"NT\",calculate!$B14=\"\"),NOT(calculate!$B15=\"Ac\")),10^(VLOOKUP(calculate!$B16,$C$5:$H$32,2,FALSE)+VLOOKUP(calculate!$B15,$C$5:$H$32,3,FALSE)+$E$29),(IF(AND(calculate!$B17=\"CT\",NOT(calculate!$B16=\"NMe\")),10^(VLOOKUP(calculate!$B16,$C$5:$H$32,2,FALSE)+VLOOKUP(calculate!$B15,$C$5:$H$32,3,FALSE)+$D$30),10^(VLOOKUP(calculate!$B16,$C$5:$H$32,2,FALSE)+VLOOKUP(calculate!$B15,$C$5:$H$32,3,FALSE)))))))))","v":"   ---"},{"$f":"IF(OR(calculate!$B16=\"P\",calculate!$B16=\"\",calculate!$B16=\"AC\",calculate!$B16=\"NT\",calculate!$B16=\"Pc\",calculate!$B16=\"CT\",calculate!$B15=\"NT\"),\"   ---\",(IF(AND(OR(calculate!$B14=\"NT\",calculate!$B14=\"\"),calculate!$B17=\"CT\",NOT(calculate!$B15=\"Ac\"),NOT(calculate!$B16=\"NMe\")),10^(VLOOKUP(calculate!$B16,$C$5:$H$32,5)+VLOOKUP(calculate!$B15,$C$5:$H$32,6)+$H$29+$G$30),(IF(AND(OR(calculate!$B14=\"NT\",calculate!$B14=\"\"),NOT(calculate!$B15=\"Ac\")),10^(VLOOKUP(calculate!$B16,$C$5:$H$32,5)+VLOOKUP(calculate!$B15,$C$5:$H$32,6)+$H$29),(IF(AND(calculate!$B17=\"CT\",NOT(calculate!$B16=\"NMe\")),10^(VLOOKUP(calculate!$B16,$C$5:$H$32,5)+VLOOKUP(calculate!$B15,$C$5:$H$32,6)+$G$30),10^(VLOOKUP(calculate!$B16,$C$5:$H$32,5)+VLOOKUP(calculate!$B15,$C$5:$H$32,6)))))))))","v":"   ---"}]
["LEUCINE",null,"L",-0.56999999999999995,-0.13,null,-0.57625272772167702,-0.21,null,null,{"$f":"IFERROR(IF(calculate!$B16=\"   ---\",\"\",$M$2*$AA$3*$Q$3*$R17),0)","v":0},{"$f":"IFERROR(IF(calculate!$B16=\"   ---\",\"\",$M$3*$AA$4*$Q$4*$S17),0)","v":0},{"$f":"IFERROR(IF(calculate!$B16=\"   ---\",\"\",$M$4*$Q$5*$S17),0)","v":0},{"$f":"KDYŽ(NEBO(NEBO(calculate!$C$10=\"hr\",calculate!$C$10=\"s\"),calculate!$C$10=\"min\"),KDYŽ(calculate!$C12=\"\",\"   ---\",(calculate!$D12/calculate!$C12)),\"   ?\")","v":{"$error":"#NAME?"}},{"$f":"KDYŽ(NEBO(NEBO(calculate!$C$10=\"hr\",calculate!$C$10=\"s\"),calculate!$C$10=\"min\"),KDYŽ(calculate!C12=\"\",\"   ---\",LOGZ(calculate!$D12/calculate!$C12)),\"   ?\")","v":{"$error":"#NAME?"}},{"$f":"KDYŽ(NEBO(NEBO(calculate!$C$10=\"hr\",calculate!$C$10=\"s\"),calculate!$C$10=\"min\"),KDYŽ(calculate!$C12=\"\",\"\",calculate!$C12/(calculate!$D12-calculate!$C12)),\"   ?\")","v":{"$error":"#NAME?"}},{"$f":"KDYŽ(calculate!$G12=\"\",\"\",KDYŽ(calculate!$G12=\"   ?\",\"   ?\",-1*$AA$5*calculate!$B$3*LN(calculate!$G12)/1000))","v":{"$error":"#NAME?"}},{"$f":"IF(OR(calculate!$B17=\"P\",calculate!$B17=\"\",calculate!$B17=\"AC\",calculate!$B17=\"NT\",calculate!$B17=\"Pc\",calculate!$B17=\"CT\",calculate!$B16=\"NT\"),\"   ---\",(IF(AND(OR(calculate!$B15=\"NT\",calculate!$B15=\"\"),calculate!$B18=\"CT\",NOT(calculate!$B16=\"Ac\"),NOT(calculate!$B17=\"NMe\")),10^(VLOOKUP(calculate!$B17,$C$5:$H$32,2,FALSE)+VLOOKUP(calculate!$B16,$C$5:$H$32,3,FALSE)+$E$29+$D$30),(IF(AND(OR(calculate!$B15=\"NT\",calculate!$B15=\"\"),NOT(calculate!$B16=\"Ac\")),10^(VLOOKUP(calculate!$B17,$C$5:$H$32,2,FALSE)+VLOOKUP(calculate!$B16,$C$5:$H$32,3,FALSE)+$E$29),(IF(AND(calculate!$B18=\"CT\",NOT(calculate!$B17=\"NMe\")),10^(VLOOKUP(calculate!$B17,$C$5:$H$32,2,FALSE)+VLOOKUP(calculate!$B16,$C$5:$H$32,3,FALSE)+$D$30),10^(VLOOKUP(calculate!$B17,$C$5:$H$32,2,FALSE)+VLOOKUP(calculate!$B16,$C$5:$H$32,3,FALSE)))))))))","v":"   ---"},{"$f":"IF(OR(calculate!$B17=\"P\",calculate!$B17=\"\",calculate!$B17=\"AC\",calculate!$B17=\"NT\",calculate!$B17=\"Pc\",calculate!$B17=\"CT\",calculate!$B16=\"NT\"),\"   ---\",(IF(AND(OR(calculate!$B15=\"NT\",calculate!$B15=\"\"),calculate!$B18=\"CT\",NOT(calculate!$B16=\"Ac\"),NOT(calculate!$B17=\"NMe\")),10^(VLOOKUP(calculate!$B17,$C$5:$H$32,5)+VLOOKUP(calculate!$B16,$C$5:$H$32,6)+$H$29+$G$30),(IF(AND(OR(calculate!$B15=\"NT\",calculate!$B15=\"\"),NOT(calculate!$B16=\"Ac\")),10^(VLOOKUP(calculate!$B17,$C$5:$H$32,5)+VLOOKUP(calculate!$B16,$C$5:$H$32,6)+$H$29),(IF(AND(calculate!$B18=\"CT\",NOT(calculate!$B17=\"NMe\")),10^(VLOOKUP(calculate!$B17,$C$5:$H$32,5)+VLOOKUP(calculate!$B16,$C$5:$H$32,6)+$G$30),10^(VLOOKUP(calculate!$B17,$C$5:$H$32,5)+VLOOKUP(calculate!$B16,$C$5:$H$32,6)))))))))","v":"   ---"}]
["METHIONINE",null,"M",-0.64,-0.28000000000000003,null,-8.9548426529264397E-3,0.11,null,null,{"$f":"IFERROR(IF(calculate!$B17=\"   ---\",\"\",$M$2*$AA$3*$Q$3*$R18),0)","v":8.382302617878651E-11},{"$f":"IFERROR(IF(calculate!$B17=\"   ---\",\"\",$M$3*$AA$4*$Q$4*$S18),0)","v":175.84615183198551},{"$f":"IFERROR(IF(calculate!$B17=\"   ---\",\"\",$M$4*$Q$5*$S18),0)","v":1.4419703576422594E-2},{"$f":"KDYŽ(NEBO(NEBO(calculate!$C$10=\"hr\",calculate!$C$10=\"s\"),calculate!$C$10=\"min\"),KDYŽ(calculate!$C13=\"\",\"   ---\",(calculate!$D13/calculate!$C13)),\"   ?\")","v":{"$error":"#NAME?"}},{"$f":"KDYŽ(NEBO(NEBO(calculate!$C$10=\"hr\",calculate!$C$10=\"s\"),calculate!$C$10=\"min\"),KDYŽ(calculate!C13=\"\",\"   ---\",LOGZ(calculate!$D13/calculate!$C13)),\"   ?\")","v":{"$error":"#NAME?"}},{"$f":"KDYŽ(NEBO(NEBO(calculate!$C$10=\"hr\",calculate!$C$10=\"s\"),calculate!$C$10=\"min\"),KDYŽ(calculate!$C13=\"\",\"\",calculate!$C13/(calculate!$D13-calculate!$C13)),\"   ?\")","v":{"$error":"#NAME?"}},{"$f":"KDYŽ(calculate!$G13=\"\",\"\",KDYŽ(calculate!$G13=\"   ?\",\"   ?\",-1*$AA$5*calculate!$B$3*LN(calculate!$G13)/1000))","v":{"$error":"#NAME?"}},{"$f":"IF(OR(calculate!$B18=\"P\",calculate!$B18=\"\",calculate!$B18=\"AC\",calculate!$B18=\"NT\",calculate!$B18=\"Pc\",calculate!$B18=\"CT\",calculate!$B17=\"NT\"),\"   ---\",(IF(AND(OR(calculate!$B16=\"NT\",calculate!$B16=\"\"),calculate!$B19=\"CT\",NOT(calculate!$B17=\"Ac\"),NOT(calculate!$B18=\"NMe\")),10^(VLOOKUP(calculate!$B18,$C$5:$H$32,2,FALSE)+VLOOKUP(calculate!$B17,$C$5:$H$32,3,FALSE)+$E$29+$D$30),(IF(AND(OR(calculate!$B16=\"NT\",calculate!$B16=\"\"),NOT(calculate!$B17=\"Ac\")),10^(VLOOKUP(calculate!$B18,$C$5:$H$32,2,FALSE)+VLOOKUP(calculate!$B17,$C$5:$H$32,3,FALSE)+$E$29),(IF(AND(calculate!$B19=\"CT\",NOT(calculate!$B18=\"NMe\")),10^(VLOOKUP(calculate!$B18,$C$5:$H$32,2,FALSE)+VLOOKUP(calculate!$B17,$C$5:$H$32,3,FALSE)+$D$30),10^(VLOOKUP(calculate!$B18,$C$5:$H$32,2,FALSE)+VLOOKUP(calculate!$B17,$C$5:$H$32,3,FALSE)))))))))","v":1.5302075423061577E-2},{"$f":"IF(OR(calculate!$B18=\"P\",calculate!$B18=\"\",calculate!$B18=\"AC\",calculate!$B18=\"NT\",calculate!$B18=\"Pc\",calculate!$B18=\"CT\",calculate!$B17=\"NT\"),\"   ---\",(IF(AND(OR(calculate!$B16=\"NT\",calculate!$B16=\"\"),calculate!$B19=\"CT\",NOT(calculate!$B17=\"Ac\"),NOT(calculate!$B18=\"NMe\")),10^(VLOOKUP(calculate!$B18,$C$5:$H$32,5)+VLOOKUP(calculate!$B17,$C$5:$H$32,6)+$H$29+$G$30),(IF(AND(OR(calculate!$B16=\"NT\",calculate!$B16=\"\"),NOT(calculate!$B17=\"Ac\")),10^(VLOOKUP(calculate!$B18,$C$5:$H$32,5)+VLOOKUP(calculate!$B17,$C$5:$H$32,6)+$H$29),(IF(AND(calculate!$B19=\"CT\",NOT(calculate!$B18=\"NMe\")),10^(VLOOKUP(calculate!$B18,$C$5:$H$32,5)+VLOOKUP(calculate!$B17,$C$5:$H$32,6)+$G$30),10^(VLOOKUP(calculate!$B18,$C$5:$H$32,5)+VLOOKUP(calculate!$B17,$C$5:$H$32,6)))))))))","v":180.21240203730693}]
["ASPARAGINE",null,"N",-0.57999999999999996,-0.13,null,0.49,0.32,null,null,{"$f":"IFERROR(IF(calculate!$B18=\"   ---\",\"\",$M$2*$AA$3*$Q$3*$R19),0)","v":2.2661949327812809E-9},{"$f":"IFERROR(IF(calculate!$B18=\"   ---\",\"\",$M$3*$AA$4*$Q$4*$S19),0)","v":12.701969360967833},{"$f":"IFERROR(IF(calculate!$B18=\"   ---\",\"\",$M$4*$Q$5*$S19),0)","v":1.0415845391769471E-3},{"$f":"KDYŽ(NEBO(NEBO(calculate!$C$10=\"hr\",calculate!$C$10=\"s\"),calculate!$C$10=\"min\"),KDYŽ(calculate!$C14=\"\",\"   ---\",(calculate!$D14/calculate!$C14)),\"   ?\")","v":{"$error":"#NAME?"}},{"$f":"KDYŽ(NEBO(NEBO(calculate!$C$10=\"hr\",calculate!$C$10=\"s\"),calculate!$C$10=\"min\"),KDYŽ(calculate!C14=\"\",\"   ---\",LOGZ(calculate!$D14/calculate!$C14)),\"   ?\")","v":{"$error":"#NAME?"}},{"$f":"KDYŽ(NEBO(NEBO(calculate!$C$10=\"hr\",calculate!$C$10=\"s\"),calculate!$C$10=\"min\"),KDYŽ(calculate!$C14=\"\",\"\",calculate!$C14/(calculate!$D14-calculate!$C14)),\"   ?\")","v":{"$error":"#NAME?"}},{"$f":"KDYŽ(calculate!$G14=\"\",\"\",KDYŽ(calculate!$G14=\"   ?\",\"   ?\",-1*$AA$5*calculate!$B$3*LN(calculate!$G14)/1000))","v":{"$error":"#NAME?"}},{"$f":"IF(OR(calculate!$B19=\"P\",calculate!$B19=\"\",calculate!$B19=\"AC\",calculate!$B19=\"NT\",calculate!$B19=\"Pc\",calculate!$B19=\"CT\",calculate!$B18=\"NT\"),\"   ---\",(IF(AND(OR(calculate!$B17=\"NT\",calculate!$B17=\"\"),calculate!$B20=\"CT\",NOT(calculate!$B18=\"Ac\"),NOT(calculate!$B19=\"NMe\")),10^(VLOOKUP(calculate!$B19,$C$5:$H$32,2,FALSE)+VLOOKUP(calculate!$B18,$C$5:$H$32,3,FALSE)+$E$29+$D$30),(IF(AND(OR(calculate!$B17=\"NT\",calculate!$B17=\"\"),NOT(calculate!$B18=\"Ac\")),10^(VLOOKUP(calculate!$B19,$C$5:$H$32,2,FALSE)+VLOOKUP(calculate!$B18,$C$5:$H$32,3,FALSE)+$E$29),(IF(AND(calculate!$B20=\"CT\",NOT(calculate!$B19=\"NMe\")),10^(VLOOKUP(calculate!$B19,$C$5:$H$32,2,FALSE)+VLOOKUP(calculate!$B18,$C$5:$H$32,3,FALSE)+$D$30),10^(VLOOKUP(calculate!$B19,$C$5:$H$32,2,FALSE)+VLOOKUP(calculate!$B18,$C$5:$H$32,3,FALSE)))))))))","v":0.41369880527595548},{"$f":"IF(OR(calculate!$B19=\"P\",calculate!$B19=\"\",calculate!$B19=\"AC\",calculate!$B19=\"NT\",calculate!$B19=\"Pc\",calculate!$B19=\"CT\",calculate!$B18=\"NT\"),\"   ---\",(IF(AND(OR(calculate!$B17=\"NT\",calculate!$B17=\"\"),calculate!$B20=\"CT\",NOT(calculate!$B18=\"Ac\"),NOT(calculate!$B19=\"NMe\")),10^(VLOOKUP(calculate!$B19,$C$5:$H$32,5)+VLOOKUP(calculate!$B18,$C$5:$H$32,6)+$H$29+$G$30),(IF(AND(OR(calculate!$B17=\"NT\",calculate!$B17=\"\"),NOT(calculate!$B18=\"Ac\")),10^(VLOOKUP(calculate!$B19,$C$5:$H$32,5)+VLOOKUP(calculate!$B18,$C$5:$H$32,6)+$H$29),(IF(AND(calculate!$B20=\"CT\",NOT(calculate!$B19=\"NMe\")),10^(VLOOKUP(calculate!$B19,$C$5:$H$32,5)+VLOOKUP(calculate!$B18,$C$5:$H$32,6)+$G$30),10^(VLOOKUP(calculate!$B19,$C$5:$H$32,5)+VLOOKUP(calculate!$B18,$C$5:$H$32,6)))))))))","v":13.017358556310034}]
["PROLINE",null,"P",0,-0.19477347202343501,null,0,-0.24,null,null,{"$f":"IFERROR(IF(calculate!$B19=\"   ---\",\"\",$M$2*$AA$3*$Q$3*$R20),0)","v":2.2661949327812809E-9},{"$f":"IFERROR(IF(calculate!$B19=\"   ---\",\"\",$M$3*$AA$4*$Q$4*$S20),0)","v":12.701969360967833},{"$f":"IFERROR(IF(calculate!$B19=\"   ---\",\"\",$M$4*$Q$5*$S20),0)","v":1.0415845391769471E-3},{"$f":"KDYŽ(NEBO(NEBO(calculate!$C$10=\"hr\",calculate!$C$10=\"s\"),calculate!$C$10=\"min\"),KDYŽ(calculate!$C15=\"\",\"   ---\",(calculate!$D15/calculate!$C15)),\"   ?\")","v":{"$error":"#NAME?"}},{"$f":"KDYŽ(NEBO(NEBO(calculate!$C$10=\"hr\",calculate!$C$10=\"s\"),calculate!$C$10=\"min\"),KDYŽ(calculate!C15=\"\",\"   ---\",LOGZ(calculate!$D15/calculate!$C15)),\"   ?\")","v":{"$error":"#NAME?"}},{"$f":"KDYŽ(NEBO(NEBO(calculate!$C$10=\"hr\",calculate!$C$10=\"s\"),calculate!$C$10=\"min\"),KDYŽ(calculate!$C15=\"\",\"\",calculate!$C15/(calculate!$D15-calculate!$C15)),\"   ?\")","v":{"$error":"#NAME?"}},{"$f":"KDYŽ(calculate!$G15=\"\",\"\",KDYŽ(calculate!$G15=\"   ?\",\"   ?\",-1*$AA$5*calculate!$B$3*LN(calculate!$G15)/1000))","v":{"$error":"#NAME?"}},{"$f":"IF(OR(calculate!$B20=\"P\",calculate!$B20=\"\",calculate!$B20=\"AC\",calculate!$B20=\"NT\",calculate!$B20=\"Pc\",calculate!$B20=\"CT\",calculate!$B19=\"NT\"),\"   ---\",(IF(AND(OR(calculate!$B18=\"NT\",calculate!$B18=\"\"),calculate!$B21=\"CT\",NOT(calculate!$B19=\"Ac\"),NOT(calculate!$B20=\"NMe\")),10^(VLOOKUP(calculate!$B20,$C$5:$H$32,2,FALSE)+VLOOKUP(calculate!$B19,$C$5:$H$32,3,FALSE)+$E$29+$D$30),(IF(AND(OR(calculate!$B18=\"NT\",calculate!$B18=\"\"),NOT(calculate!$B19=\"Ac\")),10^(VLOOKUP(calculate!$B20,$C$5:$H$32,2,FALSE)+VLOOKUP(calculate!$B19,$C$5:$H$32,3,FALSE)+$E$29),(IF(AND(calculate!$B21=\"CT\",NOT(calculate!$B20=\"NMe\")),10^(VLOOKUP(calculate!$B20,$C$5:$H$32,2,FALSE)+VLOOKUP(calculate!$B19,$C$5:$H$32,3,FALSE)+$D$30),10^(VLOOKUP(calculate!$B20,$C$5:$H$32,2,FALSE)+VLOOKUP(calculate!$B19,$C$5:$H$32,3,FALSE)))))))))","v":0.41369880527595548},{"$f":"IF(OR(calculate!$B20=\"P\",calculate!$B20=\"\",calculate!$B20=\"AC\",calculate!$B20=\"NT\",calculate!$B20=\"Pc\",calculate!$B20=\"CT\",calculate!$B19=\"NT\"),\"   ---\",(IF(AND(OR(calculate!$B18=\"NT\",calculate!$B18=\"\"),calculate!$B21=\"CT\",NOT(calculate!$B19=\"Ac\"),NOT(calculate!$B20=\"NMe\")),10^(VLOOKUP(calculate!$B20,$C$5:$H$32,5)+VLOOKUP(calculate!$B19,$C$5:$H$32,6)+$H$29+$G$30),(IF(AND(OR(calculate!$B18=\"NT\",calculate!$B18=\"\"),NOT(calculate!$B19=\"Ac\")),10^(VLOOKUP(calculate!$B20,$C$5:$H$32,5)+VLOOKUP(calculate!$B19,$C$5:$H$32,6)+$H$29),(IF(AND(calculate!$B21=\"CT\",NOT(calculate!$B20=\"NMe\")),10^(VLOOKUP(calculate!$B20,$C$5:$H$32,5)+VLOOKUP(calculate!$B19,$C$5:$H$32,6)+$G$30),10^(VLOOKUP(calculate!$B20,$C$5:$H$32,5)+VLOOKUP(calculate!$B19,$C$5:$H$32,6)))))))))","v":13.017358556310034}]
{"$rows_left_out":17}